Reaction Details
TargetRetinoic acid receptor beta
LigandBDBM50032219
Substrate/Competitorn/a
Meas. Tech.ChEMBL_163477 (CHEMBL772312)
EC50 4±n/a nM
Citation Beard, RLGil, DWMarler, DKHenry, EColon, DFGillett, SJArefieg, TBreen, TSKrauss, HDavies, PJChandraratna, RA Structural basis for the differential RXR & RAR activity of stilbene retinoid analogs Bioorg Med Chem Lett4:1447-1452 (1994)    Article
 
Retinoic acid receptor beta
Name:Retinoic acid receptor beta
Type:PROTEIN
Mol. Mass.:50498.70
Organism:Homo sapiens (Human)
Description:ChEMBL_1458015
Residue:455
BDBM50032219
NameBDBM50032219
Synonyms:(E)-4-(2-(5,5,8,8-tetramethyl-5,6,7,8-tetrahydronaphthalen-2-yl)prop-1-enyl)benzoic acid 4-[(1E)-2-(5,5,8,8-TETRAMETHYL-5,6,7,8-TETRAHYDRONAPHTHALEN-2-YL)PROP-1-ENYL]BENZOIC ACID 4-[(E)-2-(5,6,7,8-tetrahydro-5,5,8,8-tetramethyl-2-naphthalenyl)-1-propenyl]benzoic acid CHEMBL275311 | US9963439, TTNPB
TypeSmall organic molecule
Emp. Form.C24H28O2
Mol. Mass.348.4779
SMILESC\C(=C/c1ccc(cc1)C(O)=O)c1ccc2c(c1)C(C)(C)CCC2(C)C