Reaction Details
TargetCaspase-1
LigandBDBM50282981
Substrate/Competitorn/a
Meas. Tech.ChEBML_91007
Ki 4.7±n/a nM
Citation Mjalli, AMChapman, KTMacCoss, MThornberry, NAPeterson, EP Activated ketones as potent reversible inhibitors of interleukin-Iβ converting enzyme Bioorg Med Chem Lett4:1965-1968 (1994)    Article
 
Caspase-1
Name:Caspase-1
Type:Enzyme
Mol. Mass.:45154.13
Organism:Homo sapiens (Human)
Description:P29466
Residue:404
BDBM50282981
NameBDBM50282981
Synonyms:3-{(S)-2-[(S)-3-Methyl-2-(3-phenyl-propionylamino)-butyrylamino]-propionylamino}-4-oxo-5-phenethylamino-pentanoic acid | CHEMBL58012
TypeSmall organic molecule
Emp. Form.C30H40N4O6
Mol. Mass.552.6618
SMILESCC(C)[C@H](NC(=O)CCc1ccccc1)C(=O)N[C@@H](C)C(=O)NC(CC(O)=O)C(=O)CNCCc1ccccc1