Reaction Details
TargetCaspase-1
LigandBDBM50282982
Substrate/Competitorn/a
Meas. Tech.ChEBML_91007
Ki 120±n/a nM
Citation Mjalli, AMChapman, KTMacCoss, MThornberry, NAPeterson, EP Activated ketones as potent reversible inhibitors of interleukin-Iβ converting enzyme Bioorg Med Chem Lett4:1965-1968 (1994)    Article
 
Caspase-1
Name:Caspase-1
Type:Enzyme
Mol. Mass.:45154.13
Organism:Homo sapiens (Human)
Description:P29466
Residue:404
BDBM50282982
NameBDBM50282982
Synonyms:5-Benzylcarbamoyloxy-3-{(S)-2-[(S)-3-methyl-2-(3-phenyl-propionylamino)-butyrylamino]-propionylamino}-4-oxo-pentanoic acid | CHEMBL61521
TypeSmall organic molecule
Emp. Form.C30H38N4O8
Mol. Mass.582.6447
SMILESCC(C)[C@H](NC(=O)CCc1ccccc1)C(=O)N[C@@H](C)C(=O)NC(CC(O)=O)C(=O)COC(=O)NCc1ccccc1