Reaction Details
TargetLeukotriene B4 receptor 1
LigandBDBM50013889
Substrate/Competitorn/a
Meas. Tech.ChEMBL_98506 (CHEMBL709168)
Ki 0.120000±n/a nM
Citation Sawyer, JSchmittling, EABach, NJBaker, SFroelich, LLSaussy, DLMarder, PJackson, WT Structural analogues of LY292728, a highly potent xanthone dicarboxylic acid leukotriene B4 receptor antagonist: spatial positioning of the secondary acid group Bioorg Med Chem Lett4:2077-2082 (1994)    Article
 
Leukotriene B4 receptor 1
Name:Leukotriene B4 receptor 1
Type:Enzyme Catalytic Domain
Mol. Mass.:37582.68
Organism:Homo sapiens (Human)
Description:Q15722
Residue:352
BDBM50013889
NameBDBM50013889
Synonyms:(5S,6Z,8E,10E,12R,14Z)-5,12-dihydroxyicosa-6,8,10,14-tetraenoic acid 5,12-Dihete 5S,12R-dihydroxy-6Z,8E,10E,14Z-eicosatetraenoic acid DIHETE 12(s), 5(s) leukotriene B4
TypeSmall organic molecule
Emp. Form.C20H32O4
Mol. Mass.336.4657
SMILESCCCCC\C=C/C[C@@H](O)\C=C\C=C\C=C/[C@@H](O)CCCC(O)=O