Reaction Details
TargetLeukotriene B4 receptor 1
LigandBDBM50283054
Substrate/Competitorn/a
Meas. Tech.ChEMBL_98506 (CHEMBL709168)
Ki 0.140000±n/a nM
Citation Sawyer, JSchmittling, EABach, NJBaker, SFroelich, LLSaussy, DLMarder, PJackson, WT Structural analogues of LY292728, a highly potent xanthone dicarboxylic acid leukotriene B4 receptor antagonist: spatial positioning of the secondary acid group Bioorg Med Chem Lett4:2077-2082 (1994)    Article
 
Leukotriene B4 receptor 1
Name:Leukotriene B4 receptor 1
Type:Enzyme Catalytic Domain
Mol. Mass.:37582.68
Organism:Homo sapiens (Human)
Description:Q15722
Residue:352
BDBM50283054
NameBDBM50283054
Synonyms:4-{2-(2-Carboxy-ethyl)-3-[3-(5-ethyl-4'-fluoro-2-hydroxy-biphenyl-4-yloxy)-propoxy]-phenoxy}-benzoic acid | CHEMBL262231
TypeSmall organic molecule
Emp. Form.C33H31FO8
Mol. Mass.574.5928
SMILESCCc1cc(c(O)cc1OCCCOc1cccc(Oc2ccc(cc2)C(O)=O)c1CCC(O)=O)-c1ccc(F)cc1