Reaction Details
TargetType-2 angiotensin II receptor
LigandBDBM50283312
Substrate/Competitorn/a
Meas. Tech.ChEBML_35429
IC50 3.1±n/a nM
Citation Glinka, TWde Laszlo, SESiegl, PKChang, RSKivlighn, SDSchorn, TSFaust, KAChen, TBZingaro, GJLotti, VJGreenlee, WJ Development of angiotensin II antagonists with equipotent affinity for human AT1 and AT2 receptor subtypes. Bioorg Med Chem Lett4:2337-2342 (1994)    Article
 
Type-2 angiotensin II receptor
Name:Type-2 angiotensin II receptor
Type:Enzyme Catalytic Domain
Mol. Mass.:41201.61
Organism:Homo sapiens (Human)
Description:Angiotensin II, central 0 0::P50052
Residue:363
BDBM50283312
NameBDBM50283312
Synonyms:4'-[2-Ethyl-6-(3-isopropyl-ureido)-4-oxo-4H-quinazolin-3-ylmethyl]-3'-fluoro-biphenyl-2-sulfonic acid 4-ethyl-2-fluoro-benzoylamide | CHEMBL311160
TypeSmall organic molecule
Emp. Form.C36H35F2N5O5S
Mol. Mass.687.755
SMILESCCc1ccc(C(=O)NS(=O)(=O)c2ccccc2-c2ccc(Cn3c(CC)nc4ccc(NC(=O)NC(C)C)cc4c3=O)c(F)c2)c(F)c1