Reaction Details
TargetType-1 angiotensin II receptor
LigandBDBM50283305
Substrate/Competitorn/a
Meas. Tech.ChEMBL_36793 (CHEMBL875934)
IC50 0.840000±n/a nM
Citation Glinka, TWde Laszlo, SESiegl, PKChang, RSKivlighn, SDSchorn, TSFaust, KAChen, TBZingaro, GJLotti, VJGreenlee, WJ Development of angiotensin II antagonists with equipotent affinity for human AT1 and AT2 receptor subtypes. Bioorg Med Chem Lett4:2337-2342 (1994)    Article
 
Type-1 angiotensin II receptor
Name:Type-1 angiotensin II receptor
Type:Protein
Mol. Mass.:41080.75
Organism:Homo sapiens (Human)
Description:P30556
Residue:359
BDBM50283305
NameBDBM50283305
Synonyms:3'-Fluoro-4'-[6-(3-isopropyl-ureido)-4-oxo-2-propyl-4H-quinazolin-3-ylmethyl]-biphenyl-2-sulfonic acid 4-ethyl-2-fluoro-benzoylamide | CHEMBL305647
TypeSmall organic molecule
Emp. Form.C37H37F2N5O5S
Mol. Mass.701.782
SMILESCCCc1nc2ccc(NC(=O)NC(C)C)cc2c(=O)n1Cc1ccc(cc1F)-c1ccccc1S(=O)(=O)NC(=O)c1ccc(CC)cc1F