Reaction Details
TargetType-1 angiotensin II receptor A/B
LigandBDBM50283305
Substrate/Competitorn/a
Meas. Tech.ChEMBL_34964 (CHEMBL647886)
IC50 0.110000±n/a nM
Citation Glinka, TWde Laszlo, SESiegl, PKChang, RSKivlighn, SDSchorn, TSFaust, KAChen, TBZingaro, GJLotti, VJGreenlee, WJ Development of angiotensin II antagonists with equipotent affinity for human AT1 and AT2 receptor subtypes. Bioorg Med Chem Lett4:2337-2342 (1994)    Article
 
Type-1 angiotensin II receptor A/B
Name:Type-1 angiotensin II receptor A/B
Type:n/a
Mol. Mass.:n/a
Description:ASSAY_ID of ChEMBL is 901964
Components:This complex has 2 components.
Component 1
Name:Type-1 angiotensin II receptor B
Synonyms:AGTRB_RAT Agtr1 Angiotensin II AT1B Angiotensin II type 1b (AT-1b) receptor Type-1B angiotensin II receptor
Type:Enzyme Catalytic Domain
Mol. Mass.:40929.44
Organism:RAT
Description:Angiotensin II AT1B 0 RAT::P29089
Residue:359
Component 2
Name:Type-1 angiotensin II receptor A
Synonyms:AGTRA_RAT Agtr1 Angiotensin II AT1 Angiotensin II receptor (AT-1) type-1 Type-1A angiotensin II receptor
Type:Enzyme Catalytic Domain
Mol. Mass.:40910.53
Organism:RAT
Description:ANGIOTENSIN AT1 AGTR1 RAT::P25095
Residue:359
BDBM50283305
NameBDBM50283305
Synonyms:3'-Fluoro-4'-[6-(3-isopropyl-ureido)-4-oxo-2-propyl-4H-quinazolin-3-ylmethyl]-biphenyl-2-sulfonic acid 4-ethyl-2-fluoro-benzoylamide | CHEMBL305647
TypeSmall organic molecule
Emp. Form.C37H37F2N5O5S
Mol. Mass.701.782
SMILESCCCc1nc2ccc(NC(=O)NC(C)C)cc2c(=O)n1Cc1ccc(cc1F)-c1ccccc1S(=O)(=O)NC(=O)c1ccc(CC)cc1F