Reaction Details
TargetSigma non-opioid intracellular receptor 1
LigandBDBM50283398
Substrate/Competitorn/a
Meas. Tech.ChEBML_201299
Ki 2.5±n/a nM
Citation Cain, GAChristos, TEEyermann, CJGilligan, PJGrigoriadis, DEJohnson, ALTam, S Novel conformationally restricted aromatic piperidines as selective sigma receptor ligands Bioorg Med Chem Lett4:329-334 (1994)    Article
 
Sigma non-opioid intracellular receptor 1
Name:Sigma non-opioid intracellular receptor 1
Type:Enzyme Catalytic Domain
Mol. Mass.:25124.85
Organism:Homo sapiens (Human)
Description:Q99720
Residue:223
BDBM50283398
NameBDBM50283398
Synonyms:(1-Benzyl-piperidin-4-yl)-(3-phenyl-prop-2-ynyl)-amine; compound with (E)-but-2-enedioic acid | CHEMBL115934
TypeSmall organic molecule
Emp. Form.C21H24N2
Mol. Mass.304.4287
SMILESC(NC1CCN(Cc2ccccc2)CC1)C#Cc1ccccc1