Reaction Details
TargetVoltage-dependent L-type calcium channel subunit alpha-1C
LigandBDBM50283427
Substrate/Competitorn/a
Meas. Tech.ChEBML_42915
IC50>1000±n/a nM
Citation Kane, JMCarr, AACheng, HCDudley, MWRampe, DStaeger, MA Heterocyclic guanidines as calcium antagonists Bioorg Med Chem Lett4:351-354 (1994)    Article
 
Voltage-dependent L-type calcium channel subunit alpha-1C
Name:Voltage-dependent L-type calcium channel subunit alpha-1C
Type:Enzyme Catalytic Domain
Mol. Mass.:243492.26
Organism:RAT
Description:Calcium channel 0 RAT::P22002
Residue:2169
BDBM50283427
NameBDBM50283427
Synonyms:(2,2-Diphenyl-ethyl)-(1,4,5,6-tetrahydro-pyrimidin-2-yl)-amine | CHEMBL119046
TypeSmall organic molecule
Emp. Form.C18H21N3
Mol. Mass.279.3794
SMILESC(NC1=NCCCN1)C(c1ccccc1)c1ccccc1