Reaction Details
TargetVoltage-dependent L-type calcium channel subunit alpha-1C
LigandBDBM50283421
Substrate/Competitorn/a
Meas. Tech.ChEMBL_42915 (CHEMBL654396)
IC50>1000±n/a nM
Citation Kane, JMCarr, AACheng, HCDudley, MWRampe, DStaeger, MA Heterocyclic guanidines as calcium antagonists Bioorg Med Chem Lett4:351-354 (1994)    Article
 
Voltage-dependent L-type calcium channel subunit alpha-1C
Name:Voltage-dependent L-type calcium channel subunit alpha-1C
Type:Enzyme Catalytic Domain
Mol. Mass.:243492.26
Organism:RAT
Description:Calcium channel 0 RAT::P22002
Residue:2169
BDBM50283421
NameBDBM50283421
Synonyms:((E)-Azacyclotridec-1-en-2-yl)-(2,2-diphenyl-pentyl)-amine | CHEMBL441653
TypeSmall organic molecule
Emp. Form.C29H42N2
Mol. Mass.418.6572
SMILESCCCC(CNC1=NCCCCCCCCCCC1)(c1ccccc1)c1ccccc1