Reaction Details
TargetNeutrophil elastase
LigandBDBM50283470
Substrate/Competitorn/a
Meas. Tech.ChEBML_86540
Ki 29000±n/a nM
Citation Romeo, GRusso, FGuccione, SChabin, RKuo, DKnight, WB Synthesis of new thiazinoindole derivatives and their evaluation as inhibitors of human leukocyte elastase and other related serine proteases Bioorg Med Chem Lett4:2399-2404 (1994)    Article
 
Neutrophil elastase
Name:Neutrophil elastase
Type:Enzyme
Mol. Mass.:28532.38
Organism:Homo sapiens (Human)
Description:P08246
Residue:267
BDBM50283470
NameBDBM50283470
Synonyms:2-(4-Chloro-phenylamino)-5H-[1,3]thiazino[5,4-b]indol-4-one | CHEMBL79118
TypeSmall organic molecule
Emp. Form.C16H10ClN3OS
Mol. Mass.327.788
SMILESOc1sc(Nc2ccc(Cl)cc2)nc2c1nc1ccccc21