Reaction Details
TargetAdenosine receptor A1
LigandBDBM50051243
Substrate/Competitorn/a
Meas. Tech.ChEMBL_29476 (CHEMBL640469)
Ki 651±n/a nM
Citation Baraldi, PGManfredini, SSimoni, DZappaterra, LZocchi, CDionisotti, SOngini, E Synthesis of new pyrazolo[4,3-e]1,2,4-triazolo[1,5-c] pyrimidine and 1,2,3-triazolo[4,5-e]1,2,4-triazolo[1,5-c] pyrimidine displaying potent and selective activity as A2a adenosine receptor antagonists. Bioorg Med Chem Lett4:2539-2544 (1994)    Article
 
Adenosine receptor A1
Name:Adenosine receptor A1
Type:Protein
Mol. Mass.:36704.13
Organism:Rattus norvegicus (rat)
Description:n/a
Residue:326
BDBM50051243
NameBDBM50051243
Synonyms:2-Furan-2-yl-7-methyl-7H-pyrazolo[4,3-e][1,2,4]triazolo[1,5-c]pyrimidin-5-ylamine | CHEMBL277589
TypeSmall organic molecule
Emp. Form.C11H9N7O
Mol. Mass.255.2355
SMILESCn1ncc2c1nc(N)n1nc(nc21)-c1ccco1