Reaction Details
TargetType-2 angiotensin II receptor
LigandBDBM50283762
Substrate/Competitorn/a
Meas. Tech.ChEBML_36766
IC50 12±n/a nM
Citation Chang, LLAshton, WTFlanagan, KLRivero, RAChen, TBO'Malley, SSZingaro, GJKivlighn, SDSiegl, PKLotti, VJChang, RSGreenlee, WJ Potent triazolinone-based angiotensin II receptor antagonists with equivalent affinity for both the AT1 and AT2 subtypes Bioorg Med Chem Lett4:2787-2792 (1994)    Article
 
Type-2 angiotensin II receptor
Name:Type-2 angiotensin II receptor
Type:Enzyme Catalytic Domain
Mol. Mass.:41346.62
Organism:RAT
Description:Angiotensin II AT2 0 0::P35351
Residue:363
BDBM50283762
NameBDBM50283762
Synonyms:4'-[3-Butyl-5-oxo-1-(2-trifluoromethyl-phenyl)-1,5-dihydro-[1,2,4]triazol-4-ylmethyl]-3'-fluoro-biphenyl-2-sulfonic acid 2-chloro-benzoylamide | CHEMBL329679
TypeSmall organic molecule
Emp. Form.C33H27ClF4N4O4S
Mol. Mass.687.103
SMILESCCCCc1nn(-c2ccccc2C(F)(F)F)c(=O)n1Cc1ccc(cc1F)-c1ccccc1S(=O)(=O)NC(=O)c1ccccc1Cl