Reaction Details
TargetType-1 angiotensin II receptor
LigandBDBM50283758
Substrate/Competitorn/a
Meas. Tech.ChEBML_36625
IC50 110±n/a nM
Citation Chang, LLAshton, WTFlanagan, KLRivero, RAChen, TBO'Malley, SSZingaro, GJKivlighn, SDSiegl, PKLotti, VJChang, RSGreenlee, WJ Potent triazolinone-based angiotensin II receptor antagonists with equivalent affinity for both the AT1 and AT2 subtypes Bioorg Med Chem Lett4:2787-2792 (1994)    Article
 
Type-1 angiotensin II receptor
Name:Type-1 angiotensin II receptor
Type:Protein
Mol. Mass.:41080.75
Organism:Homo sapiens (Human)
Description:P30556
Residue:359
BDBM50283758
NameBDBM50283758
Synonyms:4'-[3-Butyl-5-oxo-1-(2-trifluoromethyl-phenyl)-1,5-dihydro-[1,2,4]triazol-4-ylmethyl]-3'-fluoro-5-propyl-biphenyl-2-sulfonic acid 2-chloro-benzoylamide | CHEMBL96314
TypeSmall organic molecule
Emp. Form.C36H33ClF4N4O4S
Mol. Mass.729.183
SMILESCCCCc1nn(-c2ccccc2C(F)(F)F)c(=O)n1Cc1ccc(cc1F)-c1cc(CCC)ccc1S(=O)(=O)NC(=O)c1ccccc1Cl