Reaction Details
TargetHistamine H3 receptor
LigandBDBM50283867
Substrate/Competitorn/a
Meas. Tech.ChEMBL_85844 (CHEMBL692952)
Ki 0.740000±n/a nM
Citation Stark, HKrause, MArrang, JMLigneau, XSchwartz, JCSchunack, W Unsymmetrically substituted guanidines as potent histamine H3-receptor antagonists Bioorg Med Chem Lett4:2907-2912 (1994)    Article
 
Histamine H3 receptor
Name:Histamine H3 receptor
Type:Enzyme Catalytic Domain
Mol. Mass.:48753.61
Organism:GUINEA PIG
Description:HISTAMINE H3 HRH3 GUINEA PIG::Q9JI35
Residue:445
BDBM50283867
NameBDBM50283867
Synonyms:CHEMBL98165 | N-Cyclohexylmethyl-N'-[3-(1H-imidazol-4-yl)-propyl]-guanidine
TypeSmall organic molecule
Emp. Form.C14H25N5
Mol. Mass.263.3818
SMILESN=C(NCCCc1cnc[nH]1)NCC1CCCCC1