Reaction Details
TargetTubulin alpha-1A chain
LigandBDBM50005480
Substrate/Competitorn/a
Meas. Tech.ChEMBL_211690 (CHEMBL820472)
IC50 3900±n/a nM
Citation Shirai, RTokuda, KKoiso, YIwasaki, S Synthesis and nti-tubulin activity of aza-combretastatins Bioorg Med Chem Lett4:699-704 (1994)    Article
 
Tubulin alpha-1A chain
Name:Tubulin alpha-1A chain
Type:Protein
Mol. Mass.:50049.25
Organism:Sus scrofa (Pig)
Description:P02550
Residue:451
BDBM50005480
NameBDBM50005480
Synonyms:(-)-combretastatin (Z)-5-(3,4,5-trimethoxystyryl)-2-methoxyphenol (combretastin A-4)2-Methoxy-5-[2-(3,4,5-trimethoxy-phenyl)-vinyl]-phenol 2-Methoxy-5-[(Z)-2-(3,4,5-trimethoxy-phenyl)-vinyl]-phenol 2-methoxy-5-(3,4,5-trimethoxystyryl)phenol 5-(3,4,5-trimethoxystyryl)-2-methoxyphenol CHEMBL67 Combrestatin A4 Combretastatin Combretastin A-4 combretastatin A-4, (CSA4) | combretastin A4
TypeSmall organic molecule
Emp. Form.C18H20O5
Mol. Mass.316.3484
SMILESCOc1ccc(\C=C/c2cc(OC)c(OC)c(OC)c2)cc1O