Reaction Details
TargetPeptidyl-prolyl cis-trans isomerase FKBP1A
LigandBDBM50284187
Substrate/Competitorn/a
Meas. Tech.ChEBML_66282
EC50 16±n/a nM
Citation Goulet, MTHodkey, DWStaruch, MJDumont, FJLin, SHung, SHSiekierka, JJWyvratt, MJ Alkyl ether derivatives of the FK-506 related, immunosuppressive macrolide L-683,742 (C31-O-desmethyl ascomycin) Bioorg Med Chem Lett4:927-930 (1994)    Article
 
Peptidyl-prolyl cis-trans isomerase FKBP1A
Name:Peptidyl-prolyl cis-trans isomerase FKBP1A
Type:Isomerase
Mol. Mass.:11953.09
Organism:Homo sapiens (Human)
Description:P62942
Residue:108
BDBM50284187
NameBDBM50284187
Synonyms:C32-O-cinnamyl ether analogue of L-683590 | CHEMBL176774
TypeSmall organic molecule
Emp. Form.C47H71NO13
Mol. Mass.858.0655
SMILESCC[C@@H]1\C=C(C)\C[C@H](C)C[C@H](OC)[C@H]2OC(O)([C@@H](C)C[C@@H]2OC)C(=O)C(=O)N2CCCC[C@H]2C(=O)O[C@@H]([C@H](C)[C@@H](O)CC1=O)C(\C)=C\[C@@H]1CC[C@@H](OCc2ccco2)[C@H](O)C1