Reaction Details
TargetPlatelet-activating factor receptor
LigandBDBM50005232
Substrate/Competitorn/a
Meas. Tech.ChEMBL_162886 (CHEMBL768982)
IC50 55±n/a nM
Citation Chung, SKBan, SHKim, SHKim, BEWoo, SHSummers, JBConway, RG Synthesis and bioactivities of heterocyclic lipids as PAF antagonists. 2 Bioorg Med Chem Lett5:1097-1102 (1995)    Article
 
Platelet-activating factor receptor
Name:Platelet-activating factor receptor
Type:Protein
Mol. Mass.:39005.63
Organism:Cavia porcellus
Description:n/a
Residue:342
BDBM50005232
NameBDBM50005232
Synonyms:(R)-2-{[Acetyl-(2-methoxy-3-octadecylcarbamoyloxy-propoxycarbonyl)-amino]-methyl}-1-ethyl-pyridinium; chloride 2-{[Acetyl-(2-methoxy-3-octadecylcarbamoyloxy-propoxycarbonyl)-amino]-methyl}-1-ethyl-pyridinium; chloride CHEMBL274420 | CV-6209
TypeSmall organic molecule
Emp. Form.C34H60N3O6
Mol. Mass.606.8562
(=O)OCC(COC(=O)N(Cc1cccc[n+]1CC)C(C)=O)OC