Reaction Details
TargetPolyunsaturated fatty acid 5-lipoxygenase
LigandBDBM50284680
Substrate/Competitorn/a
Meas. Tech.ChEBML_3964
IC50 1900±n/a nM
Citation Andrews, EGAntognoli, GWBreslow, RCarta, MPCarty, TJChambers, RJCheng, JBCohan, VLCollins, JLDamon, DBDelehunt, JEggler, JFEskra, JDFreiert, KWHada, WAMarfat, AMasamune, HMelvin, LSMularski, CJNaclerio, BA Synthesis and pharmacological profile of two novel heterocyclic chromanols, CP-80,798 and CP-85,958, as potent LTD4 receptor antagonists Bioorg Med Chem Lett5:1365-1370 (1995)    Article
 
Polyunsaturated fatty acid 5-lipoxygenase
Name:Polyunsaturated fatty acid 5-lipoxygenase
Type:PROTEIN
Mol. Mass.:78082.31
Organism:Rattus norvegicus
Description:ChEMBL_1432947
Residue:673
BDBM50284680
NameBDBM50284680
Synonyms:(3S,4S)-3-Pyridin-3-ylmethyl-6-(quinolin-2-ylmethoxy)-chroman-4-ol CHEMBL282524 | CP-80798
TypeSmall organic molecule
Emp. Form.C25H22N2O3
Mol. Mass.398.4538
SMILESO[C@H]1[C@@H](Cc2cccnc2)COc2ccc(OCc3ccc4ccccc4n3)cc12