Reaction Details
TargetStromelysin-1
LigandBDBM50284750
Substrate/Competitorn/a
Meas. Tech.ChEBML_102094
Ki 25000±n/a nM
Citation Castelhano, ALBilledeau, RDewdney, NDonnelly, SHorne, SKurz, LJLiak, TJMartin, RUppington, RYuan, ZKrantz, A Novel indolactam-based inhibitors of matrix metalloproteinases Bioorg Med Chem Lett5:1415-1420 (1995)    Article
 
Stromelysin-1
Name:Stromelysin-1
Type:Enzyme
Mol. Mass.:53973.13
Organism:Homo sapiens (Human)
Description: P08254
Residue:477
BDBM50284750
NameBDBM50284750
Synonyms:(R)-2-[(S)-3-Methyl-1-((S)-9-oxo-1,8-diaza-tricyclo[10.6.1.0*13,18*]nonadeca-12(19),13(18),14,16-tetraen-10-ylcarbamoyl)-butylamino]-butyric acid | CHEMBL30782
TypeSmall organic molecule
Emp. Form.C27H40N4O4
Mol. Mass.484.6309
SMILESCC[C@@H](N[C@@H](CC(C)C)C(=O)N[C@H]1Cc2cn(CCCCCCNC1=O)c1ccccc21)C(O)=O