Reaction Details
TargetInterstitial collagenase
LigandBDBM50284750
Substrate/Competitorn/a
Meas. Tech.ChEBML_101765
Ki 20±n/a nM
Citation Castelhano, ALBilledeau, RDewdney, NDonnelly, SHorne, SKurz, LJLiak, TJMartin, RUppington, RYuan, ZKrantz, A Novel indolactam-based inhibitors of matrix metalloproteinases Bioorg Med Chem Lett5:1415-1420 (1995)    Article
 
Interstitial collagenase
Name:Interstitial collagenase
Type:Enzyme
Mol. Mass.:54010.26
Organism:Homo sapiens (Human)
Description: P03956
Residue:469
BDBM50284750
NameBDBM50284750
Synonyms:(R)-2-[(S)-3-Methyl-1-((S)-9-oxo-1,8-diaza-tricyclo[10.6.1.0*13,18*]nonadeca-12(19),13(18),14,16-tetraen-10-ylcarbamoyl)-butylamino]-butyric acid | CHEMBL30782
TypeSmall organic molecule
Emp. Form.C27H40N4O4
Mol. Mass.484.6309
SMILESCC[C@@H](N[C@@H](CC(C)C)C(=O)N[C@H]1Cc2cn(CCCCCCNC1=O)c1ccccc21)C(O)=O