Reaction Details
Target72 kDa type IV collagenase
LigandBDBM50086884
Substrate/Competitorn/a
Meas. Tech.ChEMBL_101925 (CHEMBL710555)
Ki 0.200000±n/a nM
Citation Castelhano, ALBilledeau, RDewdney, NDonnelly, SHorne, SKurz, LJLiak, TJMartin, RUppington, RYuan, ZKrantz, A Novel indolactam-based inhibitors of matrix metalloproteinases Bioorg Med Chem Lett5:1415-1420 (1995)    Article
 
72 kDa type IV collagenase
Name:72 kDa type IV collagenase
Type:Enzyme
Mol. Mass.:73870.36
Organism:Homo sapiens (Human)
Description: P08253
Residue:660
BDBM50086884
NameBDBM50086884
Synonyms:(R)-N*4*-Hydroxy-2-isobutyl-N*1*-((S)-9-oxo-1,8-diaza-tricyclo[10.6.1.0*13,18*]nonadeca-12(19),13(18),14,16-tetraen-10-yl)-succinamide N*4*-Hydroxy-2-isobutyl-N*1*-(9-oxo-1,8-diaza-tricyclo[10.6.1.0*13,18*]nonadeca-12(19),13(18),14,16-tetraen-10-yl)-succinamide | N4-HYDROXY-2-ISOBUTYL-N1-(9-OXO-1,8-DIAZA-TRICYCLO[10.6.1.013,18]NONADECA-12(19),13,15,17-TETRAEN-10-YL)-SUCCINAMIDE
TypeSmall organic molecule
Emp. Form.C25H36N4O4
Mol. Mass.456.5777
SMILESCC(C)C[C@H](CC(=O)NO)C(=O)N[C@H]1Cc2cn(CCCCCCNC1=O)c1ccccc21