Reaction Details
TargetProtein kinase C epsilon type
LigandBDBM3153
Substrate/Competitorn/a
Meas. Tech.ChEBML_160953
IC50 50±n/a nM
Citation Heerding, JMLampe, JWDarges, JWStamper, ML Protein kinase C inhibitory activities of balanol analogs bearing carboxylic acid replacements Bioorg Med Chem Lett5:1839-1842 (1995)    Article
 
Protein kinase C epsilon type
Name:Protein kinase C epsilon type
Type:Enzyme
Mol. Mass.:83680.45
Organism:Homo sapiens (Human)
Description:The recombinant human PKC enzymes were produced using a baculovirus expression system in SF9 cells
Residue:737
BDBM3153
NameBDBM3153
Synonyms:2-{[2,6-dihydroxy-4-({[(1R,2R)-2-[(4-hydroxybenzene)amido]cyclopentyl]oxy}carbonyl)phenyl]carbonyl}-3-hydroxybenzoic acid CHEMBL52529
TypeSmall organic molecule
Emp. Form.C27H23NO10
Mol. Mass.521.4722
SMILESOC(=O)c1cccc(O)c1C(=O)c1c(O)cc(cc1O)C(=O)O[C@@H]1CCC[C@H]1NC(=O)c1ccc(O)cc1