Reaction Details
TargetGastrin/cholecystokinin type B receptor
LigandBDBM50285012
Substrate/Competitorn/a
Meas. Tech.ChEBML_40187
IC50 0.810000±n/a nM
Citation Lowe, JADrozda, SEMcLean, SBryce, DKCrawford, RTZorn, SMorrone, JAppleton, TALombardo, F A water soluble benzazepine cholecystokinin-B receptor antagonist Bioorg Med Chem Lett5:1933-1936 (1995)    Article
 
Gastrin/cholecystokinin type B receptor
Name:Gastrin/cholecystokinin type B receptor
Type:G Protein-Coupled Receptor (GPCR)
Mol. Mass.:48445.79
Organism:Homo sapiens (Human)
Description:Stable expression of human CCK-2 receptors in HEK 293 cells.
Residue:447
BDBM50285012
NameBDBM50285012
Synonyms:CHEMBL301418 | N-tert-Butyl-2-((3R,5R)-8-methyl-2-oxo-5-phenyl-3-{3-[3-(1H-tetrazol-5-yl)-phenyl]-ureido}-2,3,4,5-tetrahydro-benzo[b]azepin-1-yl)-acetamide
TypeSmall organic molecule
Emp. Form.C31H34N8O3
Mol. Mass.566.6535
SMILESCc1ccc2[C@H](C[C@@H](NC(=O)Nc3cccc(c3)-c3nnn[nH]3)C(=O)N(CC(=O)NC(C)(C)C)c2c1)c1ccccc1