Reaction Details
TargetAcetylcholinesterase
LigandBDBM50285186
Substrate/Competitorn/a
Meas. Tech.ChEBML_28302
IC50 3800±n/a nM
Citation Alisi, MABrufani, MFilocamo, LGostoli, GLicandro, ECesta, MCLappa, SMarchesini, DPagella, P Synthesis and structure-activity relationships of new acetylcholinesterase inhibitors: Morpholinoalkylcarbamoyloxyeseroline derivatives Bioorg Med Chem Lett5:2077-2080 (1995)    Article
 
Acetylcholinesterase
Name:Acetylcholinesterase
Type:Enzyme
Mol. Mass.:67792.70
Organism:Homo sapiens (Human)
Description:P22303
Residue:614
BDBM50285186
NameBDBM50285186
Synonyms:(3-Morpholin-4-yl-propyl)-carbamic acid (3aS,8aR)-1,3a,8-trimethyl-1,2,3,3a,8,8a-hexahydro-pyrrolo[2,3-b]indol-5-yl ester | CHEMBL65667
TypeSmall organic molecule
Emp. Form.C21H32N4O3
Mol. Mass.388.5038
SMILESCN1CC[C@]2(C)[C@H]1N(C)c1ccc(OC(=O)NCCCN3CCOCC3)cc21