Reaction Details
TargetProtein kinase C alpha type
LigandBDBM50285235
Substrate/Competitorn/a
Meas. Tech.ChEBML_160108
IC50 9600±n/a nM
Citation Lai*, YSStamper, M Heteroatom effect in the PKC inhibitory activities of perhydroazepine analogs of balanol Bioorg Med Chem Lett5:2147-2150 (1995)    Article
 
Protein kinase C alpha type
Name:Protein kinase C alpha type
Type:Enzyme
Mol. Mass.:76755.65
Organism:Homo sapiens (Human)
Description:The recombinant human PKC enzymes were produced using a baculovirus expression system in SF9 cells
Residue:672
BDBM50285235
NameBDBM50285235
Synonyms:4-(2-Carboxy-6-hydroxy-benzoyl)-3,5-dihydroxy-benzoic acid (3R,4R)-3-(4-hydroxy-benzoylamino)-1,1-dioxo-1lambda*6*-thiepan-4-yl ester | CHEMBL303205
TypeSmall organic molecule
Emp. Form.C28H25NO12S
Mol. Mass.599.563
SMILESOC(=O)c1cccc(O)c1C(=O)c1c(O)cc(cc1O)C(=O)O[C@@H]1CCCS(=O)(=O)C[C@@H]1NC(=O)c1ccc(O)cc1