Reaction Details
TargetProtein kinase C zeta type
LigandBDBM50285234
Substrate/Competitorn/a
Meas. Tech.ChEBML_161462
IC50 121000±n/a nM
Citation Lai*, YSStamper, M Heteroatom effect in the PKC inhibitory activities of perhydroazepine analogs of balanol Bioorg Med Chem Lett5:2147-2150 (1995)    Article
 
Protein kinase C zeta type
Name:Protein kinase C zeta type
Type:Enzyme
Mol. Mass.:67649.13
Organism:Homo sapiens (Human)
Description:n/a
Residue:592
BDBM50285234
NameBDBM50285234
Synonyms:4-(2-Carboxy-6-hydroxy-benzoyl)-3,5-dihydroxy-benzoic acid (3R,4R)-3-(4-hydroxy-benzoylamino)-thiepan-4-yl ester | CHEMBL67788
TypeSmall organic molecule
Emp. Form.C28H25NO10S
Mol. Mass.567.564
SMILESOC(=O)c1cccc(O)c1C(=O)c1c(O)cc(cc1O)C(=O)O[C@@H]1CCCSC[C@@H]1NC(=O)c1ccc(O)cc1