Reaction Details
TargetReverse transcriptase/RNaseH
LigandBDBM50285360
Substrate/Competitorn/a
Meas. Tech.ChEBML_195359
IC50 6400±n/a nM
Citation Proudfoot, JR The synthesis of a dipyrido[3,2-b:3′,4′-e][1,4]diazepinone: Convenient access to a C-ring isomer of the HIV-1 reverse transcriptase inhibitor nevirapine Bioorg Med Chem Lett5:163-166 (1995)    Article
 
Reverse transcriptase/RNaseH
Name:Reverse transcriptase/RNaseH
Type:PROTEIN
Mol. Mass.:65229.15
Organism:Human immunodeficiency virus 1
Description:ChEMBL_1473730
Residue:566
BDBM50285360
NameBDBM50285360
Synonyms:5-Ethyl-10-methyl-5,10-dihydro-3,5,6,10-tetraaza-dibenzo[a,d]cyclohepten-11-one | CHEMBL46562
TypeSmall organic molecule
Emp. Form.C14H14N4O
Mol. Mass.254.2872
SMILESCCN1c2cnccc2C(=O)N(C)c2cccnc12