Reaction Details
Target5-hydroxytryptamine receptor 1D
LigandBDBM10755
Substrate/Competitorn/a
Meas. Tech.ChEBML_1651
EC50 8.5±n/a nM
Citation Macor, JEBlank, DHDesai, KFox, CBKoe, BKLebel, LAPost, RJSchmidt, AWSchulz, DWSeymour, PA 5-cyano-1-[3-(N-methylpyrrolidin-2R-ylmethyl)indol-5-yl] benzimidazole (CP-161,242): A potent, centrally active 5-HT1D receptor agonist and benzodiazepine partial agonist Bioorg Med Chem Lett5:2391-2396 (1995)    Article
 
5-hydroxytryptamine receptor 1D
Name:5-hydroxytryptamine receptor 1D
Type:Enzyme Catalytic Domain
Mol. Mass.:41780.38
Organism:GUINEA PIG
Description:5-HT1D HTR1D GUINEA PIG::Q60484
Residue:376
BDBM10755
NameBDBM10755
Synonyms:14C-5-hydroxy tryptamine creatinine disulfate 5-HT 5-hydroxy tryptamine creatinine disulfate Serotonin | [3H]-5-HT
TypeSmall organic molecule
Emp. Form.C10H12N2O
Mol. Mass.176.2151
SMILESNCCc1c[nH]c2ccc(O)cc12