Reaction Details
TargetStromelysin-1
LigandBDBM50285572
Substrate/Competitorn/a
Meas. Tech.ChEBML_101950
Ki 180±n/a nM
Citation Sahoo, SPCaldwell, CGChapman, KTDurette, PLEsser, CKKopka, IEPolo, SASperow, KMNiedzwiecki, LMIzquierdo-Martin, MChang, BCHarrison, RKStein, RLMacCoss, MHagmann, WK Inhibition of matrix metalloproteinases by N-carboxyalkyl dipeptides: Enhanced potency and selectivity with substituted P1′ homophenylalanines Bioorg Med Chem Lett5:2441-2446 (1995)    Article
 
Stromelysin-1
Name:Stromelysin-1
Type:Enzyme
Mol. Mass.:53973.13
Organism:Homo sapiens (Human)
Description: P08254
Residue:477
BDBM50285572
NameBDBM50285572
Synonyms:(R)-2-((S)-4-(4-isopropylphenyl)-1-((S)-4-methyl-1-oxo-1-(phenylamino)pentan-2-ylamino)-1-oxobutan-2-ylamino)propanoic acid CHEMBL81264
TypeSmall organic molecule
Emp. Form.C28H39N3O4
Mol. Mass.481.627
SMILESCC(C)C[C@H](NC(=O)[C@H](CCc1ccc(cc1)C(C)C)N[C@H](C)C(O)=O)C(=O)Nc1ccccc1