Reaction Details
TargetInterstitial collagenase
LigandBDBM50241370
Substrate/Competitorn/a
Meas. Tech.ChEBML_101752
Ki 470±n/a nM
Citation Sahoo, SPCaldwell, CGChapman, KTDurette, PLEsser, CKKopka, IEPolo, SASperow, KMNiedzwiecki, LMIzquierdo-Martin, MChang, BCHarrison, RKStein, RLMacCoss, MHagmann, WK Inhibition of matrix metalloproteinases by N-carboxyalkyl dipeptides: Enhanced potency and selectivity with substituted P1′ homophenylalanines Bioorg Med Chem Lett5:2441-2446 (1995)    Article
 
Interstitial collagenase
Name:Interstitial collagenase
Type:Enzyme
Mol. Mass.:54010.26
Organism:Homo sapiens (Human)
Description: P03956
Residue:469
BDBM50241370
NameBDBM50241370
Synonyms:(R)-2-[(S)-1-((S)-4-guanidino-1-phenylcarbamoyl-butylcarbamoyl)-3-phenyl-propylamino]-propionic acid L-702842
TypeSmall organic molecule
Emp. Form.C25H34N6O4
Mol. Mass.482.5753
SMILES[#6]-[#6@@H](-[#7]-[#6@@H](-[#6]-[#6]-c1ccccc1)-[#6](=O)-[#7]-[#6@@H](-[#6]-[#6]-[#6]\[#7]=[#6](\[#7])-[#7])-[#6](=O)-[#7]-c1ccccc1)-[#6](-[#8])=O