Reaction Details
TargetInterstitial collagenase
LigandBDBM50285577
Substrate/Competitorn/a
Meas. Tech.ChEBML_101752
Ki 510±n/a nM
Citation Sahoo, SPCaldwell, CGChapman, KTDurette, PLEsser, CKKopka, IEPolo, SASperow, KMNiedzwiecki, LMIzquierdo-Martin, MChang, BCHarrison, RKStein, RLMacCoss, MHagmann, WK Inhibition of matrix metalloproteinases by N-carboxyalkyl dipeptides: Enhanced potency and selectivity with substituted P1′ homophenylalanines Bioorg Med Chem Lett5:2441-2446 (1995)    Article
 
Interstitial collagenase
Name:Interstitial collagenase
Type:Enzyme
Mol. Mass.:54010.26
Organism:Homo sapiens (Human)
Description: P03956
Residue:469
BDBM50285577
NameBDBM50285577
Synonyms:(R)-2-((S)-4-(3-hydroxyphenyl)-1-((S)-4-methyl-1-oxo-1-(phenylamino)pentan-2-ylamino)-1-oxobutan-2-ylamino)propanoic acid CHEMBL81672
TypeSmall organic molecule
Emp. Form.C25H33N3O5
Mol. Mass.455.5466
SMILESCC(C)C[C@H](NC(=O)[C@H](CCc1cccc(O)c1)N[C@H](C)C(O)=O)C(=O)Nc1ccccc1