Reaction Details
TargetBeta-3 adrenergic receptor
LigandBDBM50285930
Substrate/Competitorn/a
Meas. Tech.ChEBML_39192
IC50 6±n/a nM
Citation Hattori, KNagano, MKato, TNakanishi, IImai, KKinoshita, TSakane, K Asymmetric synthesis of FR165914: A novel β3-adrenergic agonist with a benzocycloheptene structure Bioorg Med Chem Lett5:2821-2824 (1995)    Article
 
Beta-3 adrenergic receptor
Name:Beta-3 adrenergic receptor
Type:PROTEIN
Mol. Mass.:43161.83
Organism:Rattus norvegicus
Description:ChEMBL_1509452
Residue:400
BDBM50285930
NameBDBM50285930
Synonyms:CHEMBL421193 FR-165914
TypeSmall organic molecule
Emp. Form.C22H20ClNO7
Mol. Mass.445.851
SMILESO[C@@H](CN[C@H]1CCCc2cc3OC(Oc3cc2C1)(C([O-])=O)C([O-])=O)c1cccc(Cl)c1