Reaction Details
Target5-hydroxytryptamine receptor 1A
LigandBDBM50286089
Substrate/Competitorn/a
Meas. Tech.ChEBML_1446
Ki 16±n/a nM
Citation Dahlgren, TDean, RLGharat, LAJohansson, AMLambert, GLi, HBNelson, DLYang, YMartin, AR Synthesis and serotonin receptor binding properties of 5-substituted 3-(1′,2′,5′,6′-tetrahydropyridin-3′-yl) indoles Bioorg Med Chem Lett5:2963-2968 (1995)    Article
 
5-hydroxytryptamine receptor 1A
Name:5-hydroxytryptamine receptor 1A
Type:G Protein-Coupled Receptor (GPCR)
Mol. Mass.:46445.29
Organism:Rattus norvegicus (rat)
Description:Binding assays were performed using rat hippocampal membranes.
Residue:422
BDBM50286089
NameBDBM50286089
Synonyms:CHEMBL100814 | N-[3-(1-Methyl-1,2,5,6-tetrahydro-pyridin-3-yl)-1H-indol-5-yl]-acetamide
TypeSmall organic molecule
Emp. Form.C16H19N3O
Mol. Mass.269.3416
SMILESCN1CCC=C(C1)c1c[nH]c2ccc(NC(C)=O)cc12