Reaction Details
TargetCholecystokinin receptor type A
LigandBDBM50286159
Substrate/Competitorn/a
Meas. Tech.ChEBML_49403
IC50 690±n/a nM
Citation Holladay, MWBennett, MJBai, HRalston, JWKerwin, JFStashko, MMiller, TRO'Neill, ABNadzan, AMBrioni, JLin, CW Amino acid-derived piperidides as novel CCKB ligands with anxiolytic-like properties Bioorg Med Chem Lett5:3057-3062 (1995)    Article
 
Cholecystokinin receptor type A
Name:Cholecystokinin receptor type A
Type:n/a
Mol. Mass.:48229.77
Organism:Cavia porcellus
Description:n/a
Residue:430
BDBM50286159
NameBDBM50286159
Synonyms:5-(R)-Oxo-5-(4-phenylcarbamoyl-piperidin-1-yl)-4-(3-m-tolyl-ureido)-pentanoic acid benzyl ester | CHEMBL102526
TypeSmall organic molecule
Emp. Form.C32H36N4O5
Mol. Mass.556.652
SMILESCc1cccc(NC(=O)N[C@H](CCC(=O)OCc2ccccc2)C(=O)N2CCC(CC2)C(=O)Nc2ccccc2)c1