Reaction Details
TargetCholecystokinin receptor type A
LigandBDBM50286166
Substrate/Competitorn/a
Meas. Tech.ChEBML_49403
IC50 1400±n/a nM
Citation Holladay, MWBennett, MJBai, HRalston, JWKerwin, JFStashko, MMiller, TRO'Neill, ABNadzan, AMBrioni, JLin, CW Amino acid-derived piperidides as novel CCKB ligands with anxiolytic-like properties Bioorg Med Chem Lett5:3057-3062 (1995)    Article
 
Cholecystokinin receptor type A
Name:Cholecystokinin receptor type A
Type:n/a
Mol. Mass.:48229.77
Organism:Cavia porcellus
Description:n/a
Residue:430
BDBM50286166
NameBDBM50286166
Synonyms:CHEMBL418987 | Pyrrolidine-1-carboxylic acid (R)-3-(4-benzoyl-piperidin-1-yl)-3-oxo-2-(3-m-tolyl-ureido)-propyl ester
TypeSmall organic molecule
Emp. Form.C28H34N4O5
Mol. Mass.506.5934
SMILESCc1cccc(NC(=O)N[C@H](COC(=O)N2CCCC2)C(=O)N2CCC(CC2)C(=O)c2ccccc2)c1