Reaction Details
TargetCholecystokinin receptor type A
LigandBDBM50286157
Substrate/Competitorn/a
Meas. Tech.ChEBML_49403
IC50 1300±n/a nM
Citation Holladay, MWBennett, MJBai, HRalston, JWKerwin, JFStashko, MMiller, TRO'Neill, ABNadzan, AMBrioni, JLin, CW Amino acid-derived piperidides as novel CCKB ligands with anxiolytic-like properties Bioorg Med Chem Lett5:3057-3062 (1995)    Article
 
Cholecystokinin receptor type A
Name:Cholecystokinin receptor type A
Type:n/a
Mol. Mass.:48229.77
Organism:Cavia porcellus
Description:n/a
Residue:430
BDBM50286157
NameBDBM50286157
Synonyms:1-{(R)-1-[(R)-(4-Benzoyl-piperidin-1-yl)-oxo-methyl]-2-benzyloxy-propyl}-3-m-tolyl-urea | CHEMBL321800
TypeSmall organic molecule
Emp. Form.C31H35N3O4
Mol. Mass.513.6273
SMILESC[C@@H](OCc1ccccc1)[C@@H](NC(=O)Nc1cccc(C)c1)C(=O)N1CCC(CC1)C(=O)c1ccccc1