Reaction Details
TargetCholecystokinin receptor type A
LigandBDBM50286156
Substrate/Competitorn/a
Meas. Tech.ChEBML_49403
IC50 1300±n/a nM
Citation Holladay, MWBennett, MJBai, HRalston, JWKerwin, JFStashko, MMiller, TRO'Neill, ABNadzan, AMBrioni, JLin, CW Amino acid-derived piperidides as novel CCKB ligands with anxiolytic-like properties Bioorg Med Chem Lett5:3057-3062 (1995)    Article
 
Cholecystokinin receptor type A
Name:Cholecystokinin receptor type A
Type:n/a
Mol. Mass.:48229.77
Organism:Cavia porcellus
Description:n/a
Residue:430
BDBM50286156
NameBDBM50286156
Synonyms:4-(4-Benzoyl-piperidin-1-yl)-4-(R)-oxo-3-(3-m-tolyl-ureido)-butyric acid benzyl ester | CHEMBL105404
TypeSmall organic molecule
Emp. Form.C31H33N3O5
Mol. Mass.527.6108
SMILESCc1cccc(NC(=O)N[C@H](CC(=O)OCc2ccccc2)C(=O)N2CCC(CC2)C(=O)c2ccccc2)c1