Reaction Details
TargetGastrin/cholecystokinin type B receptor
LigandBDBM50286151
Substrate/Competitorn/a
Meas. Tech.ChEBML_49412
IC50 900±n/a nM
Citation Holladay, MWBennett, MJBai, HRalston, JWKerwin, JFStashko, MMiller, TRO'Neill, ABNadzan, AMBrioni, JLin, CW Amino acid-derived piperidides as novel CCKB ligands with anxiolytic-like properties Bioorg Med Chem Lett5:3057-3062 (1995)    Article
 
Gastrin/cholecystokinin type B receptor
Name:Gastrin/cholecystokinin type B receptor
Type:G Protein-Coupled Receptor (GPCR)
Mol. Mass.:48445.79
Organism:Homo sapiens (Human)
Description:Stable expression of human CCK-2 receptors in HEK 293 cells.
Residue:447
BDBM50286151
NameBDBM50286151
Synonyms:(R)-5-(4-Benzoyl-piperidin-1-yl)-5-oxo-4-(3-m-tolyl-ureido)-pentanoic acid benzyl ester CHEMBL103276
TypeSmall organic molecule
Emp. Form.C32H35N3O5
Mol. Mass.541.6374
SMILESCc1cccc(NC(=O)N[C@H](CCC(=O)OCc2ccccc2)C(=O)N2CCC(CC2)C(=O)c2ccccc2)c1