Reaction Details
TargetGastrin/cholecystokinin type B receptor
LigandBDBM50286166
Substrate/Competitorn/a
Meas. Tech.ChEBML_49412
IC50 100±n/a nM
Citation Holladay, MWBennett, MJBai, HRalston, JWKerwin, JFStashko, MMiller, TRO'Neill, ABNadzan, AMBrioni, JLin, CW Amino acid-derived piperidides as novel CCKB ligands with anxiolytic-like properties Bioorg Med Chem Lett5:3057-3062 (1995)    Article
 
Gastrin/cholecystokinin type B receptor
Name:Gastrin/cholecystokinin type B receptor
Type:G Protein-Coupled Receptor (GPCR)
Mol. Mass.:48445.79
Organism:Homo sapiens (Human)
Description:Stable expression of human CCK-2 receptors in HEK 293 cells.
Residue:447
BDBM50286166
NameBDBM50286166
Synonyms:CHEMBL418987 | Pyrrolidine-1-carboxylic acid (R)-3-(4-benzoyl-piperidin-1-yl)-3-oxo-2-(3-m-tolyl-ureido)-propyl ester
TypeSmall organic molecule
Emp. Form.C28H34N4O5
Mol. Mass.506.5934
SMILESCc1cccc(NC(=O)N[C@H](COC(=O)N2CCCC2)C(=O)N2CCC(CC2)C(=O)c2ccccc2)c1