Reaction Details
TargetGastrin/cholecystokinin type B receptor
LigandBDBM50286165
Substrate/Competitorn/a
Meas. Tech.ChEBML_49412
IC50 230±n/a nM
Citation Holladay, MWBennett, MJBai, HRalston, JWKerwin, JFStashko, MMiller, TRO'Neill, ABNadzan, AMBrioni, JLin, CW Amino acid-derived piperidides as novel CCKB ligands with anxiolytic-like properties Bioorg Med Chem Lett5:3057-3062 (1995)    Article
 
Gastrin/cholecystokinin type B receptor
Name:Gastrin/cholecystokinin type B receptor
Type:G Protein-Coupled Receptor (GPCR)
Mol. Mass.:48445.79
Organism:Homo sapiens (Human)
Description:Stable expression of human CCK-2 receptors in HEK 293 cells.
Residue:447
BDBM50286165
NameBDBM50286165
Synonyms:1-{1-((R)-Benzyloxymethyl)-2-[4-(4-fluoro-benzoyl)-piperidin-1-yl]-2-oxo-ethyl}-3-m-tolyl-urea | CHEMBL102879
TypeSmall organic molecule
Emp. Form.C30H32FN3O4
Mol. Mass.517.5912
SMILESCc1cccc(NC(=O)N[C@H](COCc2ccccc2)C(=O)N2CCC(CC2)C(=O)c2ccc(F)cc2)c1