Reaction Details
TargetNeutrophil elastase
LigandBDBM50282874
Substrate/Competitorn/a
Meas. Tech.ChEMBL_86690 (CHEMBL694281)
Ki 0.300000±n/a nM
Citation Hlasta, DJBell, MRCourt, JJCundy, KCDesai, RCFerguson, EWGordon, RJKumar, VMaycock, ALSubramanyam, CDunlap, RPEiff, SLFranke, CAMura, AJRowlands, AG The design of potent and stable benzisothiazolone inhibitors of human leukocyte elastase Bioorg Med Chem Lett5:331-336 (1995)    Article
 
Neutrophil elastase
Name:Neutrophil elastase
Type:Enzyme
Mol. Mass.:28532.38
Organism:Homo sapiens (Human)
Description:P08246
Residue:267
BDBM50282874
NameBDBM50282874
Synonyms:4-Isopropyl-1,1-dioxo-2-(1-phenyl-1H-tetrazol-5-ylsulfanylmethyl)-1,2-dihydro-1lambda*6*-benzo[d]isothiazol-3-one | CHEMBL50974
TypeSmall organic molecule
Emp. Form.C18H17N5O3S2
Mol. Mass.415.489
SMILESCC(C)c1cccc2c1C(=O)N(CSc1nnnn1-c1ccccc1)S2(=O)=O