Reaction Details
TargetInterstitial collagenase
LigandBDBM50031772
Substrate/Competitorn/a
Meas. Tech.ChEBML_101897
Ki 5100±n/a nM
Citation Tomczuk, BEGowravaram, MRJohnson, JSDelecki, DCook, ERGhose, AKMathiowetz, AMSpurlino, JCRubin, BSmith, DLPulvino, TWahl, RC Hydroxamate inhibitors of the matrix metallo-proteinases (MMPs) containing novel P1′ heteroatom based modifications Bioorg Med Chem Lett5:343-348 (1995)    Article
 
Interstitial collagenase
Name:Interstitial collagenase
Type:Enzyme
Mol. Mass.:54010.26
Organism:Homo sapiens (Human)
Description: P03956
Residue:469
BDBM50031772
NameBDBM50031772
Synonyms:(R)-3-((S)-1-Methylcarbamoyl-2-phenyl-ethylcarbamoyl)-heptanedioic acid 1-hydroxyamide 7-propylamide CHEMBL85766
TypeSmall organic molecule
Emp. Form.C21H32N4O5
Mol. Mass.420.5026
SMILESCCCNC(=O)CCC[C@H](CC(=O)NO)C(=O)N[C@@H](Cc1ccccc1)C(=O)NC