Reaction Details
TargetNeutrophil collagenase
LigandBDBM50286354
Substrate/Competitorn/a
Meas. Tech.ChEBML_105200
Ki<2±n/a nM
Citation Wahl, RCPulvino, TAMathiowetz, AMGhose, AKJohnson, JSDelecki, DCook, ERGainor, JAGowravaram, MRTomczuk, BE Hydroxamate inhibitors of human gelatinase B (92 kDa) Bioorg Med Chem Lett5:349-352 (1995)    Article
 
Neutrophil collagenase
Name:Neutrophil collagenase
Type:Enzyme
Mol. Mass.:53413.48
Organism:Homo sapiens (Human)
Description:P22894
Residue:467
BDBM50286354
NameBDBM50286354
Synonyms:(R)-N*4*-Hydroxy-N*1*-((S)-1-methylcarbamoyl-2-phenyl-ethyl)-2-(6-phenyl-hexyl)-succinamide | CHEMBL116318
TypeSmall organic molecule
Emp. Form.C26H35N3O4
Mol. Mass.453.5738
SMILESCNC(=O)[C@H](Cc1ccccc1)NC(=O)[C@H](CCCCCCc1ccccc1)CC(=O)NO