Reaction Details
TargetNeutrophil collagenase
LigandBDBM50031784
Substrate/Competitorn/a
Meas. Tech.ChEBML_105200
Ki<2±n/a nM
Citation Wahl, RCPulvino, TAMathiowetz, AMGhose, AKJohnson, JSDelecki, DCook, ERGainor, JAGowravaram, MRTomczuk, BE Hydroxamate inhibitors of human gelatinase B (92 kDa) Bioorg Med Chem Lett5:349-352 (1995)    Article
 
Neutrophil collagenase
Name:Neutrophil collagenase
Type:Enzyme
Mol. Mass.:53413.48
Organism:Homo sapiens (Human)
Description:P22894
Residue:467
BDBM50031784
NameBDBM50031784
Synonyms:(R)-N*4*-Hydroxy-N*1*-((S)-1-methylcarbamoyl-2-phenyl-ethyl)-2-(4-phenoxy-butyl)-succinamide CHEMBL410259
TypeSmall organic molecule
Emp. Form.C24H31N3O5
Mol. Mass.441.52
SMILESCNC(=O)[C@H](Cc1ccccc1)NC(=O)[C@H](CCCCOc1ccccc1)CC(=O)NO