Reaction Details
TargetStromelysin-1
LigandBDBM50286351
Substrate/Competitorn/a
Meas. Tech.ChEBML_102092
Ki 3500±n/a nM
Citation Wahl, RCPulvino, TAMathiowetz, AMGhose, AKJohnson, JSDelecki, DCook, ERGainor, JAGowravaram, MRTomczuk, BE Hydroxamate inhibitors of human gelatinase B (92 kDa) Bioorg Med Chem Lett5:349-352 (1995)    Article
 
Stromelysin-1
Name:Stromelysin-1
Type:Enzyme
Mol. Mass.:53973.13
Organism:Homo sapiens (Human)
Description: P08254
Residue:477
BDBM50286351
NameBDBM50286351
Synonyms:(R)-2-(4-Benzyloxy-butyl)-N*4*-hydroxy-N*1*-methylcarbamoylmethyl-succinamide | CHEMBL117296
TypeSmall organic molecule
Emp. Form.C18H27N3O5
Mol. Mass.365.4241
SMILESCNC(=O)CNC(=O)[C@H](CCCCOCc1ccccc1)CC(=O)NO