Reaction Details
TargetInterstitial collagenase
LigandBDBM50286351
Substrate/Competitorn/a
Meas. Tech.ChEBML_101763
Ki>100±n/a nM
Citation Wahl, RCPulvino, TAMathiowetz, AMGhose, AKJohnson, JSDelecki, DCook, ERGainor, JAGowravaram, MRTomczuk, BE Hydroxamate inhibitors of human gelatinase B (92 kDa) Bioorg Med Chem Lett5:349-352 (1995)    Article
 
Interstitial collagenase
Name:Interstitial collagenase
Type:Enzyme
Mol. Mass.:54010.26
Organism:Homo sapiens (Human)
Description: P03956
Residue:469
BDBM50286351
NameBDBM50286351
Synonyms:(R)-2-(4-Benzyloxy-butyl)-N*4*-hydroxy-N*1*-methylcarbamoylmethyl-succinamide | CHEMBL117296
TypeSmall organic molecule
Emp. Form.C18H27N3O5
Mol. Mass.365.4241
SMILESCNC(=O)CNC(=O)[C@H](CCCCOCc1ccccc1)CC(=O)NO