Reaction Details
TargetStromelysin-1
LigandBDBM50031790
Substrate/Competitorn/a
Meas. Tech.ChEBML_102092
Ki 14±n/a nM
Citation Wahl, RCPulvino, TAMathiowetz, AMGhose, AKJohnson, JSDelecki, DCook, ERGainor, JAGowravaram, MRTomczuk, BE Hydroxamate inhibitors of human gelatinase B (92 kDa) Bioorg Med Chem Lett5:349-352 (1995)    Article
 
Stromelysin-1
Name:Stromelysin-1
Type:Enzyme
Mol. Mass.:53973.13
Organism:Homo sapiens (Human)
Description: P08254
Residue:477
BDBM50031790
NameBDBM50031790
Synonyms:(R)-N*4*-Hydroxy-N*1*-((S)-1-methylcarbamoyl-2-phenyl-ethyl)-2-(5-phenoxy-pentyl)-succinamide CHEMBL59023
TypeSmall organic molecule
Emp. Form.C25H33N3O5
Mol. Mass.455.5466
SMILESCNC(=O)[C@H](Cc1ccccc1)NC(=O)[C@H](CCCCCOc1ccccc1)CC(=O)NO