Reaction Details
TargetCathepsin B
LigandBDBM50286434
Substrate/Competitorn/a
Meas. Tech.ChEBML_47409
IC50 25000±n/a nM
Citation Graybill, TLDolle, REOsifo, IKSchmidt, SJGregory, JSHarris, ALMiller, MS Inhibition of human erythrocyte calpain I by novel quinolinecarboxamides Bioorg Med Chem Lett5:387-392 (1995)    Article
 
Cathepsin B
Name:Cathepsin B
Type:Enzyme
Mol. Mass.:37819.69
Organism:Homo sapiens (Human)
Description:gi_63102437
Residue:339
BDBM50286434
NameBDBM50286434
Synonyms:1-(2-Chloro-4-hydroxy-phenyl)-4-oxo-7-pyridin-4-yl-1,4-dihydro-quinoline-3-carboxylic acid amide | CHEMBL340384
TypeSmall organic molecule
Emp. Form.C21H14ClN3O3
Mol. Mass.391.807
SMILESNC(=O)c1cn(-c2ccc(O)cc2Cl)c2cc(ccc2c1=O)-c1ccncc1